Target
Aurora kinase A
Ligand
BDBM116843
Substrate
Meas. Tech.
Enzyme Assay
IC50
0.85±n/a nM
Citation
 Sutton, AELan, RRichardson, TEPerrey, DVandeveer, HGHuck, BRKarra, SRChen, XXiao, YLiu-Bujalski, LGoutopoulos, AStieber, FHodous, BLQiu, HJones, RHeasley, BH Amino azaheterocyclic carboxamides US Patent  US8637532 Publication Date 1/28/2014 
Target
Name:
Aurora kinase A
Synonyms:
AIK ARK1 AURKA AYK1 Aurora kinase A (AURA) Aurora kinase A (Aurora A) Aurora-related kinase 1 BTAK Breast-tumor-amplified kinase STK15 Serine/threonine kinase 15 Serine/threonine-protein kinase aurora A hARK1
Type:
Serine/threonine-protein kinase
Mol. Mass.:
45830.98
Organism:
Homo sapiens (Human)
Description:
O14965
Residue:
403
  
Inhibitor
Name:
BDBM116843
Synonyms:
US8637532, 569
Type:
Small organic molecule
Emp. Form.:
C22H20N6O
Mol. Mass.:
384.4338
SMILES:
Cc1ccnc(Nc2cccc(CNc3ncnc4c(cccc34)C(N)=O)c2)c1
: