Target
Aurora kinase A
Ligand
BDBM116853
Substrate
Meas. Tech.
Enzyme Assay
IC50
1.3±n/a nM
Citation
 Sutton, AELan, RRichardson, TEPerrey, DVandeveer, HGHuck, BRKarra, SRChen, XXiao, YLiu-Bujalski, LGoutopoulos, AStieber, FHodous, BLQiu, HJones, RHeasley, BH Amino azaheterocyclic carboxamides US Patent  US8637532 Publication Date 1/28/2014 
Target
Name:
Aurora kinase A
Synonyms:
AIK ARK1 AURKA AYK1 Aurora kinase A (AURA) Aurora kinase A (Aurora A) Aurora-related kinase 1 BTAK Breast-tumor-amplified kinase STK15 Serine/threonine kinase 15 Serine/threonine-protein kinase aurora A hARK1
Type:
Serine/threonine-protein kinase
Mol. Mass.:
45830.98
Organism:
Homo sapiens (Human)
Description:
O14965
Residue:
403
  
Inhibitor
Name:
BDBM116853
Synonyms:
US8637532, 579
Type:
Small organic molecule
Emp. Form.:
C30H35N9O2
Mol. Mass.:
553.658
SMILES:
CN1CCN(CCC(Nc2ncnc3c(cccc23)C(N)=O)c2cccc(NC(=O)c3cc(n[nH]3)C3CC3)c2)CC1
: