Target
Aurora kinase A
Ligand
BDBM116988
Substrate
Meas. Tech.
Enzyme Assay
IC50
0.11±n/a nM
Citation
 Sutton, AELan, RRichardson, TEPerrey, DVandeveer, HGHuck, BRKarra, SRChen, XXiao, YLiu-Bujalski, LGoutopoulos, AStieber, FHodous, BLQiu, HJones, RHeasley, BH Amino azaheterocyclic carboxamides US Patent  US8637532 Publication Date 1/28/2014 
Target
Name:
Aurora kinase A
Synonyms:
AIK ARK1 AURKA AYK1 Aurora kinase A (AURA) Aurora kinase A (Aurora A) Aurora-related kinase 1 BTAK Breast-tumor-amplified kinase STK15 Serine/threonine kinase 15 Serine/threonine-protein kinase aurora A hARK1
Type:
Serine/threonine-protein kinase
Mol. Mass.:
45830.98
Organism:
Homo sapiens (Human)
Description:
O14965
Residue:
403
  
Inhibitor
Name:
BDBM116988
Synonyms:
US8637532, 715
Type:
Small organic molecule
Emp. Form.:
C24H19F2N5O3
Mol. Mass.:
463.4362
SMILES:
COc1cc(F)c(C(=O)Nc2cccc(CNc3ncnc4c(cccc34)C(N)=O)c2)c(F)c1
: