Target
Aurora kinase B
Ligand
BDBM116478
Substrate
Meas. Tech.
Enzyme Assay
IC50
330±n/a nM
Citation
 Sutton, AELan, RRichardson, TEPerrey, DVandeveer, HGHuck, BRKarra, SRChen, XXiao, YLiu-Bujalski, LGoutopoulos, AStieber, FHodous, BLQiu, HJones, RHeasley, BH Amino azaheterocyclic carboxamides US Patent  US8637532 Publication Date 1/28/2014 
Target
Name:
Aurora kinase B
Synonyms:
AIK2 AIM1 ARK2 AURKB_HUMAN Aurora B-INCENP Aurora kinase B (AURKB) STK-1 STK12 Serine/threonine-protein kinase aurora B
Type:
Protein
Mol. Mass.:
39327.72
Organism:
Homo sapiens (Human)
Description:
Q96GD4
Residue:
344
  
Inhibitor
Name:
BDBM116478
Synonyms:
US8637532, 159
Type:
Small organic molecule
Emp. Form.:
C23H18FN5O2
Mol. Mass.:
415.4197
SMILES:
NC(=O)c1cccc2c(NCc3cccc(NC(=O)c4ccc(F)cc4)c3)ncnc12
: