Target
Aurora kinase B
Ligand
BDBM116716
Substrate
Meas. Tech.
Enzyme Assay
IC50
0.57±n/a nM
Citation
 Sutton, AELan, RRichardson, TEPerrey, DVandeveer, HGHuck, BRKarra, SRChen, XXiao, YLiu-Bujalski, LGoutopoulos, AStieber, FHodous, BLQiu, HJones, RHeasley, BH Amino azaheterocyclic carboxamides US Patent  US8637532 Publication Date 1/28/2014 
Target
Name:
Aurora kinase B
Synonyms:
AIK2 AIM1 ARK2 AURKB_HUMAN Aurora B-INCENP Aurora kinase B (AURKB) STK-1 STK12 Serine/threonine-protein kinase aurora B
Type:
Protein
Mol. Mass.:
39327.72
Organism:
Homo sapiens (Human)
Description:
Q96GD4
Residue:
344
  
Inhibitor
Name:
BDBM116716
Synonyms:
US8637532, 425
Type:
Small organic molecule
Emp. Form.:
C25H22FN5O3
Mol. Mass.:
459.4723
SMILES:
COc1ccc(cc1F)C(=O)Nc1cccc(c1)C(C)Nc1ncnc2c(cccc12)C(N)=O
: