Target
Aurora kinase B
Ligand
BDBM116838
Substrate
Meas. Tech.
Enzyme Assay
IC50
0.96±n/a nM
Citation
 Sutton, AELan, RRichardson, TEPerrey, DVandeveer, HGHuck, BRKarra, SRChen, XXiao, YLiu-Bujalski, LGoutopoulos, AStieber, FHodous, BLQiu, HJones, RHeasley, BH Amino azaheterocyclic carboxamides US Patent  US8637532 Publication Date 1/28/2014 
Target
Name:
Aurora kinase B
Synonyms:
AIK2 AIM1 ARK2 AURKB_HUMAN Aurora B-INCENP Aurora kinase B (AURKB) STK-1 STK12 Serine/threonine-protein kinase aurora B
Type:
Protein
Mol. Mass.:
39327.72
Organism:
Homo sapiens (Human)
Description:
Q96GD4
Residue:
344
  
Inhibitor
Name:
BDBM116838
Synonyms:
US8637532, 564
Type:
Small organic molecule
Emp. Form.:
C25H23N5O4
Mol. Mass.:
457.4812
SMILES:
COc1ccc(cc1)C(=O)Nc1cccc(CNc2ncnc3c(cc(CO)cc23)C(N)=O)c1
: