Target
Aurora kinase B
Ligand
BDBM116971
Substrate
Meas. Tech.
Enzyme Assay
IC50
6±n/a nM
Citation
 Sutton, AELan, RRichardson, TEPerrey, DVandeveer, HGHuck, BRKarra, SRChen, XXiao, YLiu-Bujalski, LGoutopoulos, AStieber, FHodous, BLQiu, HJones, RHeasley, BH Amino azaheterocyclic carboxamides US Patent  US8637532 Publication Date 1/28/2014 
Target
Name:
Aurora kinase B
Synonyms:
AIK2 AIM1 ARK2 AURKB_HUMAN Aurora B-INCENP Aurora kinase B (AURKB) STK-1 STK12 Serine/threonine-protein kinase aurora B
Type:
Protein
Mol. Mass.:
39327.72
Organism:
Homo sapiens (Human)
Description:
Q96GD4
Residue:
344
  
Inhibitor
Name:
BDBM116971
Synonyms:
US8637532, 698
Type:
Small organic molecule
Emp. Form.:
C29H30N6O3
Mol. Mass.:
510.5869
SMILES:
COc1ccc(cc1)C(=O)Nc1cccc(c1)C(CCN1CCC1)Nc1ncnc2c(cccc12)C(N)=O
: