Target
Aurora kinase B
Ligand
BDBM116976
Substrate
Meas. Tech.
Enzyme Assay
IC50
1.5±n/a nM
Citation
 Sutton, AELan, RRichardson, TEPerrey, DVandeveer, HGHuck, BRKarra, SRChen, XXiao, YLiu-Bujalski, LGoutopoulos, AStieber, FHodous, BLQiu, HJones, RHeasley, BH Amino azaheterocyclic carboxamides US Patent  US8637532 Publication Date 1/28/2014 
Target
Name:
Aurora kinase B
Synonyms:
AIK2 AIM1 ARK2 AURKB_HUMAN Aurora B-INCENP Aurora kinase B (AURKB) STK-1 STK12 Serine/threonine-protein kinase aurora B
Type:
Protein
Mol. Mass.:
39327.72
Organism:
Homo sapiens (Human)
Description:
Q96GD4
Residue:
344
  
Inhibitor
Name:
BDBM116976
Synonyms:
US8637532, 703
Type:
Small organic molecule
Emp. Form.:
C31H34N6O3
Mol. Mass.:
538.6401
SMILES:
COc1ccc(cc1)C(=O)Nc1cccc(c1)C(CCN1CCCCC1)Nc1ncnc2c(cccc12)C(N)=O
: