Target
Aldehyde dehydrogenase, mitochondrial
Ligand
BDBM118216
Substrate
Meas. Tech.
ALDH2 Assay
pH
7.4±n/a
IC50
9±n/a nM
Comments
extracted
Citation
 Graupe, MVenkataramani, CZablocki, J ALDH-2 inhibitors in the treatment of addiction US Patent  US8673966 Publication Date 3/18/2014 
Target
Name:
Aldehyde dehydrogenase, mitochondrial
Synonyms:
ALDH class 2 ALDH2 ALDHI Aldehyde dehydrogenase (ALDH2)
Type:
Enzyme
Mol. Mass.:
56382.67
Organism:
Homo sapiens (Human)
Description:
P05091
Residue:
517
  
Inhibitor
Name:
BDBM118216
Synonyms:
US8673966, cyclopentyl 3-((3-(4- (methylsulfonamido)phenyl)-4-oxo-4H-chromen-7-yl)ethynyl)azetidine-1-carboxylate
Type:
Emp. Form.:
C27H26N2O6S
Mol. Mass.:
506.57
SMILES:
CS(=O)(=O)Nc1ccc(cc1)-c1coc2cc(ccc2c1=O)C#CC1CN(C1)C(=O)OC1CCCC1
: