Target
Macrophage colony-stimulating factor 1 receptor
Ligand
BDBM119032
Substrate
Meas. Tech.
Fluorescence Polarization Competition Assay
pH
7.5±n/a
IC50
0.6±n/a nM
Comments
extracted
Citation
 Illig, CRBallentine, SKChen, JDesJariais, RLMeegalla, SKWall, MWilson, K Inhibitors of C-FMS kinase US Patent  US8674100 Publication Date 3/18/2014 
Target
Name:
Macrophage colony-stimulating factor 1 receptor
Synonyms:
CSF1R_MOUSE Csfmr Macrophage colony-stimulating factor 1 receptor Proto-oncogene c-Fms
Type:
Protein
Mol. Mass.:
109173.45
Organism:
Mus musculus (Mouse)
Description:
P09581
Residue:
977
  
Inhibitor
Name:
BDBM119032
Synonyms:
US8674100, 45
Type:
Small organic molecule
Emp. Form.:
C26H33N5O
Mol. Mass.:
431.5731
SMILES:
CC(C)(N1CCCC1)c1ccc(NC(=O)c2ncc([nH]2)C#N)c(c1)C1=CCC(C)(C)CC1
: