Target
UDP-N-acetylglucosamine 1-carboxyvinyltransferase
Ligand
BDBM50024894
Substrate
IC50
8.8e+3±n/a nM
Citation
 Hrast, MSosic, ISink, RGobec, S Inhibitors of the peptidoglycan biosynthesis enzymes MurA-F. Bioorg Chem 55:2-15 (2014)  
Target
Name:
UDP-N-acetylglucosamine 1-carboxyvinyltransferase
Synonyms:
EPT MURA_ECOLI UDP-N-acetylglucosamine 1-carboxyvinyltransferase murA | murZ
Type:
Protein
Mol. Mass.:
44814.62
Organism:
Escherichia coli K-12 (Enterobacteria)
Description:
E. coli MurA
Residue:
419
  
Inhibitor
Name:
BDBM50024894
Synonyms:
(1R, 2S)-1,2-epoxypropyl-phosphonic acid (2R,3S)-3-methyloxiran-2-ylphosphonic acid CHEMBL1757 Fosfomycin (compound 1) Fosfomycin Sodium phosphomycin
Type:
Small organic molecule
Emp. Form.:
C3H7O4P
Mol. Mass.:
138.059
SMILES:
C[C@@H]1O[C@@H]1P(O)(O)=O
: