Target
UDP-N-acetylglucosamine 1-carboxyvinyltransferase 2
Ligand
BDBM119091
Substrate
Ki
3.5e+3±n/a nM
Citation
 Hrast, MSosic, ISink, RGobec, S Inhibitors of the peptidoglycan biosynthesis enzymes MurA-F. Bioorg Chem 55:2-15 (2014)  
Target
Name:
UDP-N-acetylglucosamine 1-carboxyvinyltransferase 2
Synonyms:
MURA2_STAAM UDP-N-acetylglucosamine 1-carboxyvinyltransferase murZ
Type:
Protein
Mol. Mass.:
45068.88
Organism:
Staphylococcus aureus (Firmicutes)
Description:
S. aureus MurA
Residue:
419
  
Inhibitor
Name:
BDBM119091
Synonyms:
Feglymicin (compound 30)
Type:
Small organic molecule
Emp. Form.:
C95H97N13O30
Mol. Mass.:
1900.8558
SMILES:
CC(C)[C@H](NC(=O)[C@H](NC(=O)[C@H](N)c1ccc(O)cc1)c1cc(O)cc(O)c1)C(=O)N[C@@H](C(=O)N[C@H](C(=O)N[C@@H](C(=O)N[C@H](C(=O)N[C@@H](C(=O)N[C@@H](C(C)C)C(=O)N[C@@H](C(=O)N[C@H](C(=O)N[C@@H](Cc1ccccc1)C(=O)N[C@@H](CC(O)=O)C(O)=O)c1ccc(O)cc1)c1cc(O)cc(O)c1)c1cc(O)cc(O)c1)c1ccc(O)cc1)c1cc(O)cc(O)c1)c1ccc(O)cc1)c1cc(O)cc(O)c1
: