Target
Cytochrome P450 3A4
Ligand
BDBM119126
Substrate
Meas. Tech.
Spectral Binding Titrations
pH
7.4±n/a
Kd
4e+2± 1e+2 nM
Comments
extracted
Citation
 Sevrioukova, IFPoulos, TL Dissecting cytochrome P450 3A4-ligand interactions using ritonavir analogues. Biochemistry 52:4474-81 (2013)  
Target
Name:
Cytochrome P450 3A4
Synonyms:
Albendazole monooxygenase CP3A4_HUMAN CYP3A4 CYPIIIA4 Cytochrome P450 3A4 (CYP3A4) Nifedipine oxidase Taurochenodeoxycholate 6-alpha-hydroxylase
Type:
Enzyme
Mol. Mass.:
57349.57
Organism:
Homo sapiens (Human)
Description:
Residue:
503
  
Inhibitor
Name:
BDBM119126
Synonyms:
GS5
Type:
Small organic molecule
Emp. Form.:
C25H40N6O4S2
Mol. Mass.:
552.753
SMILES:
C[C@@H](CC[C@H](C)NC(=O)[C@@H](NC(=O)N(C)Cc1csc(n1)C(C)C)C(C)C)NC(=O)OCc1cncs1
: