Target
Trace amine-associated receptor 1
Ligand
BDBM119180
Substrate
Meas. Tech.
Radioligand Binding Assay
Ki
19.2±n/a nM
Citation
 Nettekoven, MNorcross, RPolara, A Dihydrooxazol-2-amine derivatives US Patent  US8673950 Publication Date 3/18/2014 
Target
Name:
Trace amine-associated receptor 1
Synonyms:
TAAR1_MOUSE Taar1 Trace amine receptor 1 (TARR1) Trace amine-associated receptor1 | Trar1
Type:
Protein
Mol. Mass.:
37635.41
Organism:
Mus musculus (Mouse)
Description:
Q923Y8
Residue:
332
  
Inhibitor
Name:
BDBM119180
Synonyms:
US8673950, 47
Type:
Small organic molecule
Emp. Form.:
C17H19N5O2
Mol. Mass.:
325.3651
SMILES:
CC(=O)c1cnc(Nc2ccc(CC[C@H]3COC(N)=N3)cc2)nc1
: