Target
Trace amine-associated receptor 1
Ligand
BDBM119192
Substrate
Meas. Tech.
Radioligand Binding Assay
Ki
0.8±n/a nM
Citation
 Nettekoven, MNorcross, RPolara, A Dihydrooxazol-2-amine derivatives US Patent  US8673950 Publication Date 3/18/2014 
Target
Name:
Trace amine-associated receptor 1
Synonyms:
TAAR1_RAT Taar1 Trace amine receptor 1 (TARR1) Trace amine-associated receptor 1 (TAAR1) Trar1
Type:
Enzyme
Mol. Mass.:
38034.73
Organism:
Rattus norvegicus (Rat)
Description:
Q923Y9
Residue:
332
  
Inhibitor
Name:
BDBM119192
Synonyms:
US8673950, 59
Type:
Small organic molecule
Emp. Form.:
C16H16N6O
Mol. Mass.:
308.3378
SMILES:
NC1=N[C@@H](CCc2ccc(Nc3ncc(cn3)C#N)cc2)CO1
: