Target
P2Y purinoceptor 12
Ligand
BDBM119429
Substrate
Meas. Tech.
Binding Assay
IC50
5±n/a nM
Citation
 Nazare, MZech, GJust, MWeiss, THessler, GCzech, J Quinoline-carboxamide derivatives as P2Y12 antagonists US Patent  US8669266 Publication Date 3/11/2014 
Target
Name:
P2Y purinoceptor 12
Synonyms:
ADP-glucose receptor HORK3 P2T(AC) P2Y(AC) P2Y(cyc) P2Y12 platelet ADP receptor Purinergic receptor P2Y12 | SP1999
Type:
Enzyme
Mol. Mass.:
39458.48
Organism:
Homo sapiens (Human)
Description:
Q9H244
Residue:
342
  
Inhibitor
Name:
BDBM119429
Synonyms:
US8669266, 673
Type:
Small organic molecule
Emp. Form.:
C32H42N6O7
Mol. Mass.:
622.7119
SMILES:
CCCCOC(=O)N1CCN(CC1)C(=O)CNC(=O)c1cc(OCC(=O)N2CCC[C@H]2C(=O)NC2CCC2)c2ccccc2n1
: