Target
Prostaglandin E2 receptor EP2 subtype
Ligand
BDBM119433
Substrate
Meas. Tech.
Binding Assay
pH
6±n/a
Temperature
303.15±n/a K
Ki
2.8±n/a nM
Comments
extracted
Citation
 Hagihara, MYoneda, KOkanari, EShigetomi, M Medical composition for treatment or prophylaxis of glaucoma US Patent  US8685986 Publication Date 4/1/2014 
Target
Name:
Prostaglandin E2 receptor EP2 subtype
Synonyms:
PE2R2_HUMAN PTGER2 Prostaglandin E2 receptor Prostanoid EP2 Receptor
Type:
Enzyme
Mol. Mass.:
39775.71
Organism:
Homo sapiens (Human)
Description:
P43116
Residue:
358
  
Inhibitor
Name:
BDBM119433
Synonyms:
US8685986, 4
Type:
Small organic molecule
Emp. Form.:
C15H11NO4
Mol. Mass.:
269.2521
SMILES:
OC(=O)c1[nH]c(cc1-c1ccc(O)cc1)-c1ccoc1
: