Target
Histone deacetylase 5
Ligand
BDBM119703
Substrate
Meas. Tech.
Enzyme Assay
Temperature
303.15±n/a K
IC50
222±n/a nM
Comments
extracted
Citation
 Cossío Mora, FPZubia Olascoaga, AVara Salazar, YSan Sebastián Larzabal, EIOtaegui Ansa, DMasdeu Margalef, MAldaba Arévalo, E Histone deacetylase inhibitors based simultaneously on trisubstituted 1H-pyrroles and aromatic and heteroaromatic spacers US Patent  US8685992 Publication Date 4/1/2014 
Target
Name:
Histone deacetylase 5
Synonyms:
Antigen NY-CO-9 HDAC5 Histone acetylase 5 (HDAC5) Human HDAC5 | KIAA0600
Type:
Enzyme
Mol. Mass.:
121968.61
Organism:
Homo sapiens (Human)
Description:
Q9UQL6
Residue:
1122
  
Inhibitor
Name:
BDBM119703
Synonyms:
US8685992, 27
Type:
Small organic molecule
Emp. Form.:
C24H21N3O5
Mol. Mass.:
431.4406
SMILES:
COc1ccc(cc1)-c1cc(-c2ccoc2)c([nH]1)C(=O)NCc1ccc(cc1)C(=O)NO
: