Target
Non-receptor tyrosine-protein kinase TYK2
Ligand
BDBM120131
Substrate
Meas. Tech.
Inhibition Assay
pH
7.2±n/a
Temperature
295.15±n/a K
Ki
1.4±n/a nM
Comments
extracted
Citation
 Blench, TJEllwood, CGoodacre, SCLai, YLiang, JMacleod, CMagnuson, SRTsui, VHWilliams, KZhang, B Azabenzothiazole compounds, compositions and methods of use US Patent  US8697708 Publication Date 4/15/2014 
Target
Name:
Non-receptor tyrosine-protein kinase TYK2
Synonyms:
Non-receptor tyrosine-protein kinase TYK2 (TYK2) TYK2_HUMAN | Tyrosine-protein kinase TYK2
Type:
Protein
Mol. Mass.:
133666.03
Organism:
Homo sapiens (Human)
Description:
P29597
Residue:
1187
  
Inhibitor
Name:
BDBM120131
Synonyms:
US8697708, 16
Type:
Small organic molecule
Emp. Form.:
C16H12ClFN4OS
Mol. Mass.:
362.809
SMILES:
Fc1cccc(Cl)c1-c1nc2ccnc(NC(=O)NC3CC3)c2s1
: