Target
Neutrophil collagenase
Ligand
BDBM120242
Substrate
Meas. Tech.
Inhibition Assay
Ki
10.3±n/a nM
Citation
 Devel, LBeau, FCzarny, BDive, V Pseudodipeptides as MMP inhibitors US Patent  US8691753 Publication Date 4/8/2014 
Target
Name:
Neutrophil collagenase
Synonyms:
CLG1 MMP8 Matrix metalloproteinase-8 PMNL collagenase | PMNL-CL
Type:
Enzyme
Mol. Mass.:
53413.48
Organism:
Homo sapiens (Human)
Description:
P22894
Residue:
467
  
Inhibitor
Name:
BDBM120242
Synonyms:
US8691753, 91
Type:
Small organic molecule
Emp. Form.:
C24H29N3O7S
Mol. Mass.:
503.568
SMILES:
Cc1ccc(s1)-c1ccc(CCC(=O)N[C@@H](CCC(O)=O)C(=O)N[C@@H](CCC(O)=O)C(N)=O)cc1
: