Target
Interstitial collagenase
Ligand
BDBM92445
Substrate
Meas. Tech.
Inhibition Assay
Ki
>10000±n/a nM
Citation
 Devel, LBeau, FCzarny, BDive, V Pseudodipeptides as MMP inhibitors US Patent  US8691753 Publication Date 4/8/2014 
Target
Name:
Interstitial collagenase
Synonyms:
CLG MMP1 Matrix metalloproteinase-1 | Matrix metalloproteinase-1 (MMP-1)
Type:
Enzyme
Mol. Mass.:
54010.26
Organism:
Homo sapiens (Human)
Description:
P03956
Residue:
469
  
Inhibitor
Name:
BDBM92445
Synonyms:
Inhibitor, 10 | US8691753, 105
Type:
Small organic molecule
Emp. Form.:
C24H24N2O4S
Mol. Mass.:
436.523
SMILES:
NC(=O)[C@H](CCC(O)=O)NC(=O)CCc1ccc(cc1)-c1cc(cs1)-c1ccccc1
: