Target
Neutrophil collagenase
Ligand
BDBM120258
Substrate
Meas. Tech.
Inhibition Assay
Ki
520±n/a nM
Citation
 Devel, LBeau, FCzarny, BDive, V Pseudodipeptides as MMP inhibitors US Patent  US8691753 Publication Date 4/8/2014 
Target
Name:
Neutrophil collagenase
Synonyms:
CLG1 MMP8 Matrix metalloproteinase-8 PMNL collagenase | PMNL-CL
Type:
Enzyme
Mol. Mass.:
53413.48
Organism:
Homo sapiens (Human)
Description:
P22894
Residue:
467
  
Inhibitor
Name:
BDBM120258
Synonyms:
US8691753, 95 bis
Type:
Small organic molecule
Emp. Form.:
C31H33N3O9S
Mol. Mass.:
623.673
SMILES:
NC(=O)[C@H](CCC(O)=O)NC(=O)[C@H](CCC(O)=O)NC(=O)[C@@H](CC(O)=O)Cc1ccc(cc1)-c1cc(cs1)-c1ccccc1
: