Target
Mast/stem cell growth factor receptor Kit [1-973]
Ligand
BDBM120816
Substrate
Meas. Tech.
HTRF kinase assay
pH
7±n/a
Temperature
298.15±n/a K
IC50
2.30±0.0 nM
Comments
extracted
Citation
 Zhou, SRen, JLiu, MRen, LLiu, YGong, P Design, synthesis and pharmacological evaluation of 6,7-disubstituted-4-phenoxyquinoline derivatives as potential antitumor agents. Bioorg Chem 57:30-42 (2014)  
Target
Name:
Mast/stem cell growth factor receptor Kit [1-973]
Synonyms:
KIT Proto-oncogene c-Kit (c-Kit) | SCFR
Type:
Protein
Mol. Mass.:
109542.08
Organism:
Homo sapiens (Human)
Description:
P10721[1-973]
Residue:
973
  
Inhibitor
Name:
BDBM120816
Synonyms:
(Z)-4-(((3-fluoro-4-((6-methoxy-7-(3-morpholinopropoxy) quinolin-4-yl)oxy)phenyl)amino)methylene)-3-methyl-1-(2- (trifluoromethyl)phenyl)-1H-pyrazol-5(4H)-one (17)
Type:
Small organic molecule
Emp. Form.:
C35H33F4N5O5
Mol. Mass.:
679.6606
SMILES:
COc1cc2c(Oc3ccc(cc3F)N=Cc3c(C)[nH]n(-c4ccccc4C(F)(F)F)c3=O)ccnc2cc1OCCCN1CCOCC1
: