Target
Phosphatidylinositol 4,5-bisphosphate 3-kinase catalytic subunit gamma isoform
Ligand
BDBM119346
Substrate
Meas. Tech.
PI 3-Kinase HTRF Assay
Temperature
298.15±n/a K
IC50
<100±n/a nM
Comments
extracted
Citation
 Jessen, KGuo, XRen, PRommel, CLiu, Y Combination of kinase inhibitors and uses thereof US Patent  US9682141 Publication Date 6/20/2017 
Target
Name:
Phosphatidylinositol 4,5-bisphosphate 3-kinase catalytic subunit gamma isoform
Synonyms:
PI3-kinase p110 subunit gamma PI3Kgamma PK3CG_HUMAN Phosphatidylinositol 4,5-bisphosphate 3-kinase (PI3K) Phosphatidylinositol 4,5-bisphosphate 3-kinase catalytic subunit gamma (PI3Kgamma) Phosphatidylinositol 4,5-bisphosphate 3-kinase catalytic subunit gamma isoform (PI3K) Phosphatidylinositol-4,5-bisphosphate 3-kinase catalytic subunit gamma isoform Phosphoinositide 3-kinases gamma (PI3K gamma) p120-PI3K
Type:
Enzyme Subunit
Mol. Mass.:
126470.30
Organism:
Homo sapiens (Human)
Description:
P48736
Residue:
1102
  
Inhibitor
Name:
BDBM119346
Synonyms:
US11547697, Compound 35 | US9682141, 35
Type:
Small organic molecule
Emp. Form.:
C21H22N6O
Mol. Mass.:
374.439
SMILES:
CN1CCC(CC1)Nc1ncnc2ccc(cc12)-c1ccc2oc(N)nc2c1
: