Target
Prokineticin receptor 2
Ligand
BDBM121055
Substrate
Meas. Tech.
Calcium Mobilization Assay
Temperature
310.15±n/a K
Ki
38.7±n/a nM
Comments
extracted
Citation
 Zhou, QLi, JHuang, Q Prokineticin receptor antagonists and uses thereof US Patent  US8722896 Publication Date 5/13/2014 
Target
Name:
Prokineticin receptor 2
Synonyms:
Prokineticin receptor 2 (PRK2)
Type:
Enzyme
Mol. Mass.:
44473.96
Organism:
Cricetulus griseus (Chinese hamster)
Description:
G3H407
Residue:
391
  
Inhibitor
Name:
BDBM121055
Synonyms:
US8722896, (-)-(3R)-1-(2-Aminobenzyl)-N- (9-chloro-3,4-dihydro-2H-1,5- benzodioxepin-7-ylmethyl)-N- isobutylpyrrolidine-3- carboxamide
Type:
Small organic molecule
Emp. Form.:
C26H34ClN3O3
Mol. Mass.:
472.019
SMILES:
CC(C)CN(Cc1cc(Cl)c2OCCCOc2c1)C(=O)C1CCN(Cc2ccccc2N)C1
: