Target
Prokineticin receptor 2
Ligand
BDBM121066
Substrate
Meas. Tech.
Calcium Mobilization Assay
Temperature
310.15±n/a K
Ki
3.18±n/a nM
Comments
extracted
Citation
 Zhou, QLi, JHuang, Q Prokineticin receptor antagonists and uses thereof US Patent  US8722896 Publication Date 5/13/2014 
Target
Name:
Prokineticin receptor 2
Synonyms:
Prokineticin receptor 2 (PRK2)
Type:
Enzyme
Mol. Mass.:
44473.96
Organism:
Cricetulus griseus (Chinese hamster)
Description:
G3H407
Residue:
391
  
Inhibitor
Name:
BDBM121066
Synonyms:
US8722896, (-)-(3R)-1-(2-Methoxybenzyl)- N-(3,4-dihydro-2H-1,5- benzodioxepin-7-ylmethyl)-N- isobutylpyrrolidine-3- carboxamide
Type:
Small organic molecule
Emp. Form.:
C27H36N2O4
Mol. Mass.:
452.5857
SMILES:
COc1ccccc1CN1CC[C@H](C1)C(=O)N(CC(C)C)Cc1ccc2OCCCOc2c1
: