Target
Prokineticin receptor 2
Ligand
BDBM121040
Substrate
Meas. Tech.
Calcium Mobilization Assay
Temperature
310.15±n/a K
Ki
0.72±n/a nM
Comments
extracted
Citation
 Zhou, QLi, JHuang, Q Prokineticin receptor antagonists and uses thereof US Patent  US8722896 Publication Date 5/13/2014 
Target
Name:
Prokineticin receptor 2
Synonyms:
Prokineticin receptor 2 (PRK2)
Type:
Enzyme
Mol. Mass.:
44473.96
Organism:
Cricetulus griseus (Chinese hamster)
Description:
G3H407
Residue:
391
  
Inhibitor
Name:
BDBM121040
Synonyms:
US8722896, (+/-)-2-Methyl-3-((2- methoxy)benzylamino)-N-(9- chloro-3,4-dihydro-2H-1,5- benzodioxepin-7-ylmethyl)-N- isobutylpropanamide | US8722896, (-)-(2R)-2-Methyl-3-((2- methoxy)benzylamino)-N-(9- chloro-3,4-dihydro-2H-1,5- benzodioxepin-7-ylmethyl)-N- isobutylpropanamide
Type:
Small organic molecule
Emp. Form.:
C26H35ClN2O4
Mol. Mass.:
475.02
SMILES:
COc1ccccc1CNCC(C)C(=O)N(CC(C)C)Cc1cc(Cl)c2OCCCOc2c1
: