Target
Prokineticin receptor 2
Ligand
BDBM121279
Substrate
Meas. Tech.
Calcium Mobilization Assay
Temperature
310.15±n/a K
Ki
4.77±n/a nM
Comments
extracted
Citation
 Zhou, QLi, JHuang, Q Prokineticin receptor antagonists and uses thereof US Patent  US8722896 Publication Date 5/13/2014 
Target
Name:
Prokineticin receptor 2
Synonyms:
Prokineticin receptor 2 (PRK2)
Type:
Enzyme
Mol. Mass.:
44473.96
Organism:
Cricetulus griseus (Chinese hamster)
Description:
G3H407
Residue:
391
  
Inhibitor
Name:
BDBM121279
Synonyms:
US8722896, (+/-)-4-(Indolin-7-ylmethyl)-N-(9- chloro-3,4-dihydro-2H-1,5- benzodioxepin-7-ylmethyl)-N- isobutylmorpholine-2- carboxamide
Type:
Small organic molecule
Emp. Form.:
C28H36ClN3O4
Mol. Mass.:
514.056
SMILES:
CC(C)CN(Cc1cc(Cl)c2OCCCOc2c1)C(=O)C1CN(Cc2cccc3CCNc23)CCO1
: