Target
Prokineticin receptor 2
Ligand
BDBM121307
Substrate
Meas. Tech.
Calcium Mobilization Assay
Temperature
310.15±n/a K
Ki
1.86±n/a nM
Comments
extracted
Citation
 Zhou, QLi, JHuang, Q Prokineticin receptor antagonists and uses thereof US Patent  US8722896 Publication Date 5/13/2014 
Target
Name:
Prokineticin receptor 2
Synonyms:
Prokineticin receptor 2 (PRK2)
Type:
Enzyme
Mol. Mass.:
44473.96
Organism:
Cricetulus griseus (Chinese hamster)
Description:
G3H407
Residue:
391
  
Inhibitor
Name:
BDBM121307
Synonyms:
US8722896, (-)-(3R)-1-(Indolin-4-ylmethyl)- N-(9-chloro-2,3,4,5-tetrahydro- 1-benzoxepin-7-ylmethyl)-N- isobutylpyrrolidine-3- carboxamide
Type:
Small organic molecule
Emp. Form.:
C29H38ClN3O2
Mol. Mass.:
496.084
SMILES:
CC(C)CN(Cc1cc(Cl)c2OCCCCc2c1)C(=O)C1CCN(Cc2cccc3NCCc23)C1
: