Target
Prokineticin receptor 1
Ligand
BDBM121046
Substrate
Meas. Tech.
Calcium Mobilization Assay
Temperature
310.15±n/a K
Ki
3.64±n/a nM
Comments
extracted
Citation
 Zhou, QLi, JHuang, Q Prokineticin receptor antagonists and uses thereof US Patent  US8722896 Publication Date 5/13/2014 
Target
Name:
Prokineticin receptor 1
Synonyms:
Prokineticin receptor 1 (PRK1)
Type:
Enzyme
Mol. Mass.:
44908.29
Organism:
Cricetulus griseus (Chinese hamster)
Description:
G3HIE5
Residue:
399
  
Inhibitor
Name:
BDBM121046
Synonyms:
US8722896, (-)-(3R)-1-(1-Methyl-indol-4- ylmethyl)-N-(9-chloro-3,4- dihydro-2H-1,5-benzodioxepin- 7-ylmethyl)-N- isobutylpyrrolidine-3- carboxamide
Type:
Small organic molecule
Emp. Form.:
C29H36ClN3O3
Mol. Mass.:
510.067
SMILES:
CC(C)CN(Cc1cc(Cl)c2OCCCOc2c1)C(=O)C1CCN(Cc2cccc3n(C)ccc23)C1
: