Target
Prokineticin receptor 1
Ligand
BDBM121088
Substrate
Meas. Tech.
Calcium Mobilization Assay
Temperature
310.15±n/a K
Ki
4±n/a nM
Comments
extracted
Citation
 Zhou, QLi, JHuang, Q Prokineticin receptor antagonists and uses thereof US Patent  US8722896 Publication Date 5/13/2014 
Target
Name:
Prokineticin receptor 1
Synonyms:
Prokineticin receptor 1 (PRK1)
Type:
Enzyme
Mol. Mass.:
44908.29
Organism:
Cricetulus griseus (Chinese hamster)
Description:
G3HIE5
Residue:
399
  
Inhibitor
Name:
BDBM121088
Synonyms:
US8722896, (-)-(3R)-1-(3-Methoxybenzyl)- N-(9-chloro-3,4-dihydro-2H-1,5- benzodioxepin-7-ylmethyl)-N- isobutylpyrrolidine-3- carboxamide
Type:
Small organic molecule
Emp. Form.:
C27H35ClN2O4
Mol. Mass.:
487.031
SMILES:
COc1cccc(CN2CC[C@H](C2)C(=O)N(CC(C)C)Cc2cc(Cl)c3OCCCOc3c2)c1
: