Target
Vascular endothelial growth factor receptor 2
Ligand
BDBM50381716
Substrate
Meas. Tech.
Homogenous Time-Resolved Fluorescence Assay (HTRF)
pH
7.1±n/a
Temperature
298.15±n/a K
IC50
1.59±n/a nM
Comments
extracted
Citation
 Michaelides, MRFrey, RCurtin, M Thieno[3,2-C]pyridine kinase inhibitors with improved CYP safety profile US Patent  US8722890 Publication Date 5/13/2014 
Target
Name:
Vascular endothelial growth factor receptor 2
Synonyms:
CD_antigen=CD309 Fetal liver kinase 1 (FLK-1) KDR Protein-tyrosine kinase receptor Flk-1 VEGFR-2 VEGFR2 Vascular Endothelial Growth Factor Receptor Kinase 2 Vascular endothelial growth factor receptor 2 (KDR) Vascular endothelial growth factor receptor 2 (VEGFR2) Vascular endothelial growth factor receptor-2 (VEGFR-2)
Type:
Receptor Tyrosine Kinase
Mol. Mass.:
151510.97
Organism:
Homo sapiens (Human)
Description:
P35968
Residue:
1356
  
Inhibitor
Name:
BDBM50381716
Synonyms:
ABT-348 US8722890, 1 | US8722890, 2
Type:
Small organic molecule
Emp. Form.:
C25H21FN6O2S
Mol. Mass.:
488.537
SMILES:
Nc1ncc(-c2cnn(CCO)c2)c2scc(-c3ccc(NC(=O)Nc4cccc(F)c4)cc3)c12
: