Target
Aurora kinase B
Ligand
BDBM50381716
Substrate
Meas. Tech.
Enzyme Inhibtion Assay
pH
7.4±n/a
IC50
6.73±n/a nM
Comments
extracted
Citation
 Michaelides, MRFrey, RCurtin, M Thieno[3,2-C]pyridine kinase inhibitors with improved CYP safety profile US Patent  US8722890 Publication Date 5/13/2014 
Target
Name:
Aurora kinase B
Synonyms:
AIK2 AIM1 ARK2 AURKB_HUMAN Aurora B-INCENP Aurora kinase B (AURKB) STK-1 STK12 Serine/threonine-protein kinase aurora B
Type:
Protein
Mol. Mass.:
39327.72
Organism:
Homo sapiens (Human)
Description:
Q96GD4
Residue:
344
  
Inhibitor
Name:
BDBM50381716
Synonyms:
ABT-348 US8722890, 1 | US8722890, 2
Type:
Small organic molecule
Emp. Form.:
C25H21FN6O2S
Mol. Mass.:
488.537
SMILES:
Nc1ncc(-c2cnn(CCO)c2)c2scc(-c3ccc(NC(=O)Nc4cccc(F)c4)cc3)c12
: