Target
Tyrosine-protein kinase BTK
Ligand
BDBM122415
Substrate
Meas. Tech.
Inhibition Assay
pH
7.2±n/a
IC50
0.09±n/a nM
Comments
extracted
Citation
 Billedeau, RJKondru, RKLopez-Tapia, FJLou, YOwens, TDQian, YSo, SThakkar, KCWanner, JMorales, OJ Inhibitors of bruton's tyrosine kinase US Patent  US8729078 Publication Date 5/20/2014 
Target
Name:
Tyrosine-protein kinase BTK
Synonyms:
AGMX1 Agammaglobulinaemia tyrosine kinase B cell progenitor kinase BPK BTK_HUMAN Tyrosine Kinase BTK Tyrosine-protein kinase BTK (BTK)
Type:
Enzyme
Mol. Mass.:
76289.95
Organism:
Homo sapiens (Human)
Description:
Q06187
Residue:
659
  
Inhibitor
Name:
BDBM122415
Synonyms:
US8729078, I-25
Type:
Small organic molecule
Emp. Form.:
C30H32FN9O3
Mol. Mass.:
585.632
SMILES:
CN1CCn2nc(Nc3nn(cc3C(N)=O)-c3cccc(c3CO)-n3ncc4cc(cc(F)c4c3=O)C(C)(C)C)cc2C1
: