Target
Tyrosine-protein kinase BTK
Ligand
BDBM122442
Substrate
Meas. Tech.
Inhibition Assay
pH
7.2±n/a
IC50
0.12±n/a nM
Comments
extracted
Citation
 Billedeau, RJKondru, RKLopez-Tapia, FJLou, YOwens, TDQian, YSo, SThakkar, KCWanner, JMorales, OJ Inhibitors of bruton's tyrosine kinase US Patent  US8729078 Publication Date 5/20/2014 
Target
Name:
Tyrosine-protein kinase BTK
Synonyms:
AGMX1 Agammaglobulinaemia tyrosine kinase B cell progenitor kinase BPK BTK_HUMAN Tyrosine Kinase BTK Tyrosine-protein kinase BTK (BTK)
Type:
Enzyme
Mol. Mass.:
76289.95
Organism:
Homo sapiens (Human)
Description:
Q06187
Residue:
659
  
Inhibitor
Name:
BDBM122442
Synonyms:
US8729078, I-53
Type:
Small organic molecule
Emp. Form.:
C31H30N6O4
Mol. Mass.:
550.6077
SMILES:
CC(=O)c1ccc(Nc2nn(cc2C(N)=O)-c2cccc(c2CO)-n2ncc3cc(ccc3c2=O)C(C)(C)C)cc1
: