Target
Somatostatin receptor type 5
Ligand
BDBM123236
Substrate
Meas. Tech.
Binding Assay
pH
7.8±n/a
IC50
0.4374±n/a nM
Comments
extracted
Citation
 Duffy, JLBao, JOndeyka, DLTyagarajan, SShao, PYe, FKatipally, RZwicker, ASherer, ECPlotkin, MAMoningka, RHussain, ZWood, HBUjjainwalla, FRomero, FAFinke, PEZang, YLiu, W Spiroxazolidinone compounds US Patent  US8742110 Publication Date 6/3/2014 
Target
Name:
Somatostatin receptor type 5
Synonyms:
SOMATOSTATIN SST5 SS5-R SSR5_HUMAN Somatostatin receptor type 5 (SSTR5)
Type:
Enzyme
Mol. Mass.:
39218.02
Organism:
Homo sapiens (Human)
Description:
P35346
Residue:
364
  
Inhibitor
Name:
BDBM123236
Synonyms:
US8742110, 3-21
Type:
Small organic molecule
Emp. Form.:
C31H32F2N2O6
Mol. Mass.:
566.5924
SMILES:
CCOc1cc(CN2CCC3(CN(C(=O)O3)c3ccc(cc3F)C(O)=O)CC2)cc(OCC)c1-c1ccc(F)cc1
: