Target
Somatostatin receptor type 5
Ligand
BDBM123255
Substrate
Meas. Tech.
Binding Assay
pH
7.8±n/a
IC50
0.2432±n/a nM
Comments
extracted
Citation
 Duffy, JLBao, JOndeyka, DLTyagarajan, SShao, PYe, FKatipally, RZwicker, ASherer, ECPlotkin, MAMoningka, RHussain, ZWood, HBUjjainwalla, FRomero, FAFinke, PEZang, YLiu, W Spiroxazolidinone compounds US Patent  US8742110 Publication Date 6/3/2014 
Target
Name:
Somatostatin receptor type 5
Synonyms:
SOMATOSTATIN SST5 SS5-R SSR5_HUMAN Somatostatin receptor type 5 (SSTR5)
Type:
Enzyme
Mol. Mass.:
39218.02
Organism:
Homo sapiens (Human)
Description:
P35346
Residue:
364
  
Inhibitor
Name:
BDBM123255
Synonyms:
US8742110, 4-19
Type:
Small organic molecule
Emp. Form.:
C30H27F3N2O4
Mol. Mass.:
536.5416
SMILES:
OC(=O)c1ccc(cc1)N1CC2(CCN(Cc3cc4CCCc4cc3-c3cc(F)c(F)cc3F)CC2)OC1=O
: