Target
G-protein coupled receptor 4
Ligand
BDBM123496
Substrate
Meas. Tech.
Radio Ligand Binding Assay
pH
8±n/a
IC50
22±n/a nM
Citation
 Miltz, WOberhauser, BVaupel, AVelcicky, JWeigand, KLeleti, RRLiu, YDu, Z Pyrazolo pyrimidine derivatives US Patent  US8748435 Publication Date 6/10/2014 
Target
Name:
G-protein coupled receptor 4
Synonyms:
G-protein coupled receptor 4 GPR4 | GPR4_HUMAN
Type:
Enzyme
Mol. Mass.:
40994.40
Organism:
Homo sapiens (Human)
Description:
P46093
Residue:
362
  
Inhibitor
Name:
BDBM123496
Synonyms:
US8748435, 21
Type:
Small organic molecule
Emp. Form.:
C23H30N4O
Mol. Mass.:
378.5105
SMILES:
CCc1nn2c(C)cc(C)nc2c1Cc1ccc(OCC2CCNCC2)cc1
: