Target
Core-binding factor subunit beta
Ligand
BDBM123654
Substrate
Meas. Tech.
FRET Assay
IC50
16000±n/a nM
Citation
 Bushweller, JHGrembecka, JIllendula, ADixon, L Inhibitors of inv(16) leukemia US Patent  US8748618 Publication Date 6/10/2014 
Target
Name:
Core-binding factor subunit beta
Synonyms:
CBFB PEBB_HUMAN
Type:
Enzyme
Mol. Mass.:
21507.90
Organism:
Homo sapiens (Human)
Description:
Q13951
Residue:
182
  
Inhibitor
Name:
BDBM123654
Synonyms:
US8748618, AI-4-57 (or) LD-1-11C US8748618, NCI- 320656
Type:
Small organic molecule
Emp. Form.:
C13H11N3O
Mol. Mass.:
225.2459
SMILES:
OCc1ccc2nc([nH]c2c1)-c1ccccn1
: