Target
Core-binding factor subunit beta
Ligand
BDBM123675
Substrate
Meas. Tech.
FRET Assay
IC50
1000±n/a nM
Citation
 Bushweller, JHGrembecka, JIllendula, ADixon, L Inhibitors of inv(16) leukemia US Patent  US8748618 Publication Date 6/10/2014 
Target
Name:
Core-binding factor subunit beta
Synonyms:
CBFB PEBB_HUMAN
Type:
Enzyme
Mol. Mass.:
21507.90
Organism:
Homo sapiens (Human)
Description:
Q13951
Residue:
182
  
Inhibitor
Name:
BDBM123675
Synonyms:
US8748618, AI-10-3
Type:
Small organic molecule
Emp. Form.:
C16H16N4O
Mol. Mass.:
280.3244
SMILES:
C1CN(CCO1)c1ccc2nc([nH]c2c1)-c1ccccn1
: