Target
Alcohol dehydrogenase class-3
Ligand
BDBM123713
Substrate
Meas. Tech.
GSNOR Assay
pH
7.4±n/a
Temperature
298.15±n/a K
IC50
1820±n/a nM
Comments
extracted
Citation
 Sun, XQiu, J Dihydropyrimidin-2(1H)-one compounds as S-nitrosoglutathione reductase inhibitors US Patent  US8741915 Publication Date 6/3/2014 
Target
Name:
Alcohol dehydrogenase class-3
Synonyms:
1.1.1.- 1.1.1.284 ADHX Alcohol dehydrogenase 5 Alcohol dehydrogenase class-3 FALDH Glutathione-dependent formaldehyde dehydrogenase (GSH-FDH) alcohol dehydrogenase 3 (ADH-3)
Type:
Mol. Mass.:
39728.34
Organism:
Homo sapiens (Human)
Description:
P11766
Residue:
374
  
Inhibitor
Name:
BDBM123713
Synonyms:
US8741915, 7
Type:
Small organic molecule
Emp. Form.:
C22H19N3O5S
Mol. Mass.:
437.468
SMILES:
CCOc1cc(cc(c1O)[N+]([O-])=O)[C@H]1NC(=O)N=C(C1c1ccsc1)c1ccccc1
: