Target
Beta-secretase 1
Ligand
BDBM123865
Substrate
Meas. Tech.
Immunofluorescence Resonance Energy Transfer (FRET) Assay
pH
4.5±n/a
IC50
2100±n/a nM
Comments
extracted
Citation
 Gabellieri, EGuba, WHilpert, HMauser, HMayweg, AVRogers-Evans, MRombach, DThomas, AWoltering, TWostl, W 1,4-oxazepines as BACE1 and/or BACE2 inhibitors US Patent  US8748418 Publication Date 6/10/2014 
Target
Name:
Beta-secretase 1
Synonyms:
ASP2 Aspartyl protease 2 BACE1 Beta-secretase (BACE) Beta-secretase 1 (BACE 1) Beta-secretase 1 (BACE1) Beta-site amyloid precursor protein cleaving enzyme 1 Memapsin-2 beta-Secretase (BACE-1) | beta-Secretase (BACE1)
Type:
Protein
Mol. Mass.:
55755.10
Organism:
Homo sapiens (Human)
Description:
P56817
Residue:
501
  
Inhibitor
Name:
BDBM123865
Synonyms:
US8748418, 9
Type:
Small organic molecule
Emp. Form.:
C20H20ClF3N4O
Mol. Mass.:
424.847
SMILES:
C[C@@]1(N=C(N)COCC1(F)F)c1cc(N[C@@H]2CCc3cc(Cl)cnc23)ccc1F
: