Target
Genome polyprotein
Ligand
BDBM123413
Substrate
Meas. Tech.
Enzymatic Assay
Ki
0.1±n/a nM
Citation
 Simmen, KADe Kock, HARaboisson, PJHu, LTahri, ASurleraux, DLNilsson, KMSamuelsson, BBRosenquist, AAIvanov, VPelcman, MBelfrage, AKJohansson, PMVendeville, SM Macrocyclic inhibitors of hepatitis C virus US Patent  US8754106 Publication Date 6/17/2014 
Target
Name:
Genome polyprotein
Synonyms:
NS3/4A protein
Type:
Enzyme
Mol. Mass.:
73007.91
Organism:
Hepatitis C virus
Description:
B0B3F0
Residue:
685
  
Inhibitor
Name:
BDBM123413
Synonyms:
US8741926, 94 | US8754106, 94
Type:
Small organic molecule
Emp. Form.:
C36H43ClN6O7S2
Mol. Mass.:
771.346
SMILES:
COc1ccc2c(O[C@@H]3C[C@@H]4N(C3)C(=O)NCCCCC\C=C/[C@@H]3C[C@]3(NC4=O)C(=O)NS(=O)(=O)C3CC3)cc(nc2c1Cl)-c1nc(cs1)C(C)C
: