Target
Beta-secretase 1
Ligand
BDBM124167
Substrate
Meas. Tech.
Inhibition Assay
Temperature
310.15±n/a K
IC50
0.4±n/a nM
Comments
extracted
Citation
 Hilpert, HWostl, W 1,3-oxazines as BACE1 and/or BACE2 inhibitors US Patent  US8754075 Publication Date 6/17/2014 
Target
Name:
Beta-secretase 1
Synonyms:
ASP2 Aspartyl protease 2 BACE1 Beta-secretase (BACE) Beta-secretase 1 (BACE 1) Beta-secretase 1 (BACE1) Beta-site amyloid precursor protein cleaving enzyme 1 Memapsin-2 beta-Secretase (BACE-1) | beta-Secretase (BACE1)
Type:
Protein
Mol. Mass.:
55755.10
Organism:
Homo sapiens (Human)
Description:
P56817
Residue:
501
  
Inhibitor
Name:
BDBM124167
Synonyms:
US8754075, 38
Type:
Small organic molecule
Emp. Form.:
C19H17F2N5O2
Mol. Mass.:
385.3674
SMILES:
C[C@]1(F)COC(N)=N[C@]1(C)c1cc(NC(=O)c2ccc(cn2)C#N)ccc1F
: