Target
Phosphatidylinositol 4,5-bisphosphate 3-kinase catalytic subunit alpha isoform
Ligand
BDBM124727
Substrate
Meas. Tech.
Alphascreen Assay
pH
7±n/a
Ki
3.2±n/a nM
Comments
extracted
Citation
 Brown, MChen, YCushing, TDGonzalez Lopez De Turiso, FHe, XKohn, TJLohman, JWPattaropong, VSeganish, JShin, YSimard, JL Heterocyclic compounds and their uses US Patent  US8765940 Publication Date 7/1/2014 
Target
Name:
Phosphatidylinositol 4,5-bisphosphate 3-kinase catalytic subunit alpha isoform
Synonyms:
P42336 PI3-kinase subunit p110-alpha PIK3CA Phosphatidylinositol 3-kinase alpha (PI3Kalpha) Phosphatidylinositol 4,5-bisphosphate 3-kinase (PI3K) Phosphatidylinositol 4,5-bisphosphate 3-kinase catalytic subunit alpha (PI3Kalpha) Phosphatidylinositol 4,5-bisphosphate 3-kinase catalytic subunit alpha isoform (PI3-Ka) Phosphatidylinositol 4,5-bisphosphate 3-kinase catalytic subunit alpha isoform (PI3K p110alpha) Phosphatidylinositol 4,5-bisphosphate 3-kinase catalytic subunit alpha isoform (PI3K-alpha) Phosphatidylinositol 4,5-bisphosphate 3-kinase catalytic subunit alpha isoform (PI3Kalpha p110alpha) Phosphatidylinositol 4,5-bisphosphate 3-kinase catalytic subunit alpha isoform (PIK3CA) Phosphatidylinositol-4,5-bisphosphate 3-kinase catalytic subunit alpha isoform Phosphoinositide 3-Kinase (PI3K), alpha Chain A Phosphoinositide 3-kinases (PI3K) PtdIns-3-kinase p110 | p110 alpha
Type:
Enzyme Subunit
Mol. Mass.:
124294.87
Organism:
Homo sapiens (Human)
Description:
P42336
Residue:
1068
  
Inhibitor
Name:
BDBM124727
Synonyms:
US8765940, 2-benzyl-4-(3,3-dimethyl-6-(4-morpholinyl)-2,3-dihydro-1H-pyrrolo[3,2-b]pyridin-1-yl)-5,7-difluoro-3-methylquinoline
Type:
Small organic molecule
Emp. Form.:
C30H30F2N4O
Mol. Mass.:
500.5822
SMILES:
Cc1c(Cc2ccccc2)nc2cc(F)cc(F)c2c1N1CC(C)(C)c2ncc(cc12)N1CCOCC1
: