Target
Hematopoietic prostaglandin D synthase
Ligand
BDBM124924
Substrate
Meas. Tech.
Inhibiting Action
pH
8±n/a
IC50
61±n/a nM
Comments
extracted
Citation
 Urade, YKitade, MShigeno, KYamane, KTanaka, K Piperazine compound having a PGDS inhibitory effect US Patent  US8765750 Publication Date 7/1/2014 
Target
Name:
Hematopoietic prostaglandin D synthase
Synonyms:
GSTS Glutathione-requiring prostaglandin D synthase HPGDS Hematopoietic prostaglandin D synthase Hematopoietic prostaglandin D synthase (HPGDS) PTGDS2 Prostaglandin D Synthase
Type:
Enzyme
Mol. Mass.:
23341.07
Organism:
Homo sapiens (Human)
Description:
The protein was expressed in E. coli strain BL21(DE3) with an N-terminal 6-His tag.
Residue:
199
  
Inhibitor
Name:
BDBM124924
Synonyms:
US8765750, 9
Type:
Small organic molecule
Emp. Form.:
C30H41N7O2
Mol. Mass.:
531.6922
SMILES:
CC1C=CC=C1C(=O)N1CCN(CC1)C(=O)NC1CCN(CC1)c1ccc(CCCn2nc(C)nc2C)cc1
: