Target
Vascular endothelial growth factor receptor 2
Ligand
BDBM124970
Substrate
Meas. Tech.
Kinase Screen Assay
Kd
58±n/a nM
Citation
 Choi, HGSim, TGray, NZhou, WChang, JWZhang, JWeisberg, E Fused 2-aminothiazole compounds US Patent  US8765747 Publication Date 7/1/2014 
Target
Name:
Vascular endothelial growth factor receptor 2
Synonyms:
CD_antigen=CD309 Fetal liver kinase 1 (FLK-1) KDR Protein-tyrosine kinase receptor Flk-1 VEGFR-2 VEGFR2 Vascular Endothelial Growth Factor Receptor Kinase 2 Vascular endothelial growth factor receptor 2 (KDR) Vascular endothelial growth factor receptor 2 (VEGFR2) Vascular endothelial growth factor receptor-2 (VEGFR-2)
Type:
Receptor Tyrosine Kinase
Mol. Mass.:
151510.97
Organism:
Homo sapiens (Human)
Description:
P35968
Residue:
1356
  
Inhibitor
Name:
BDBM124970
Synonyms:
US8765747, 2
Type:
Small organic molecule
Emp. Form.:
C31H31F3N6O2S
Mol. Mass.:
608.677
SMILES:
CCN1CCN(Cc2ccc(NC(=O)c3cccc(c3)-c3ccc4nc(NC(=O)C5CC5)sc4n3)cc2C(F)(F)F)CC1
: