Target
Calcitonin gene-related peptide 1
Ligand
BDBM126175
Substrate
Meas. Tech.
Binding Assay
pH
7.4±n/a
Temperature
298.15±n/a K
Ki
17±n/a nM
Comments
extracted
Citation
 Stump, CAQuigley, AG CGRP receptor antagonists US Patent  US8778957 Publication Date 7/15/2014 
Target
Name:
Calcitonin gene-related peptide 1
Synonyms:
CALC1 CALCA_HUMAN Calcitonin gene-related peptide (CGRP alpha) | Calcitonin gene-related peptide 1
Type:
Enzyme
Mol. Mass.:
13902.80
Organism:
Homo sapiens (Human)
Description:
P06881
Residue:
128
  
Inhibitor
Name:
BDBM126175
Synonyms:
US8778957, 95
Type:
Small organic molecule
Emp. Form.:
C35H35N5O2
Mol. Mass.:
557.6847
SMILES:
CC1(Cc2ccccc2)N(Cc2ccc3cc4C[C@@]5(Cc4cc3n2)C(=O)Nc2ncccc52)CC2(CCCC2)NC1=O
: