Target
Calcitonin gene-related peptide 1
Ligand
BDBM126172
Substrate
Meas. Tech.
Binding Assay
pH
7.4±n/a
Temperature
298.15±n/a K
Ki
4.2±n/a nM
Comments
extracted
Citation
 Stump, CAQuigley, AG CGRP receptor antagonists US Patent  US8778957 Publication Date 7/15/2014 
Target
Name:
Calcitonin gene-related peptide 1
Synonyms:
CALC1 CALCA_HUMAN Calcitonin gene-related peptide (CGRP alpha) | Calcitonin gene-related peptide 1
Type:
Enzyme
Mol. Mass.:
13902.80
Organism:
Homo sapiens (Human)
Description:
P06881
Residue:
128
  
Inhibitor
Name:
BDBM126172
Synonyms:
US8778957, 19
Type:
Small organic molecule
Emp. Form.:
C27H22N4O2
Mol. Mass.:
434.4892
SMILES:
O=C1COc2ccccc2N1Cc1ccc2cc3C[C@]4(CNc5ncccc45)Cc3cc2n1
: