Target
Lysosomal Pro-X carboxypeptidase
Ligand
BDBM50364687
Substrate
Meas. Tech.
Enzyme Activity Assay
IC50
0.49±n/a nM
Citation
 Ding, FJiang, JShen, DShen, HShi, Z Spiropiperidine prolylcarboxypeptidase inhibitors US Patent  US8785634 Publication Date 7/22/2014 
Target
Name:
Lysosomal Pro-X carboxypeptidase
Synonyms:
Angiotensinase C PCP PRCP Prolylcarboxypeptidase | Prolylcarboxypeptidase (PRCP)
Type:
Enzyme
Mol. Mass.:
55805.19
Organism:
Homo sapiens (Human)
Description:
P42785
Residue:
496
  
Inhibitor
Name:
BDBM50364687
Synonyms:
CHEMBL1951476 | US8785634, 8
Type:
Small organic molecule
Emp. Form.:
C26H25ClF3N3O2
Mol. Mass.:
503.944
SMILES:
CC(C)(N1CCC2(CC1)OC(c1cccnc21)c1cc(Cl)ccn1)c1ccc(OC(F)(F)F)cc1
: